Target
Growth hormone secretagogue receptor type 1
Ligand
BDBM50089427
Substrate
Meas. Tech.
ChEMBL_1496673 (CHEMBL3579244)
EC50
189±n/a nM
Citation
 Kilian, TMKlöting, NBergmann, REls-Heindl, SBabilon, SClément-Ziza, MZhang, YBeck-Sickinger, AGChollet, C Rational design of dual peptides targeting ghrelin and Y2 receptors to regulate food intake and body weight. J Med Chem 58:4180-93 (2015)  
Target
Name:
Growth hormone secretagogue receptor type 1
Synonyms:
GH-releasing peptide receptor GHS-R GHSR_HUMAN Ghrelin receptor | Ghrelin receptor 1a (GHS-R1a)
Type:
Receptor
Mol. Mass.:
41334.57
Organism:
Homo sapiens (Human)
Description:
Receptor binding studies use plasma membranes from LLC PK-1 cells transiently transfected with hGHSR1a.
Residue:
366
  
Inhibitor
Name:
BDBM50089427
Synonyms:
CHEMBL3578006
Type:
Small organic molecule
Emp. Form.:
C49H61N9O8
Mol. Mass.:
904.0641
SMILES:
CC(C)C[C@H](NC(=O)[C@@H](Cc1c[nH]c2ccccc12)NC(=O)[C@H](Cc1ccccc1)NC(=O)[C@H](Cc1cccc2ccccc12)NC(=O)[C@@H](N)CCCCN)C(=O)N[C@@H](CC(N)=O)C(O)=O
: