Target
Tyrosine-protein kinase Fyn
Ligand
BDBM50089523
Substrate
Meas. Tech.
ChEMBL_1497041 (CHEMBL3580016)
Ki
2250±n/a nM
Citation
 Tintori, CLa Sala, GVignaroli, GBotta, LFallacara, ALFalchi, FRadi, MZamperini, CDreassi, EDello Iacono, LOrioli, DBiamonti, GGarbelli, MLossani, AGasparrini, FTuccinardi, TLaurenzana, IAngelucci, AMaga, GSchenone, SBrullo, CMusumeci, FDesogus, ACrespan, EBotta, M Studies on the ATP Binding Site of Fyn Kinase for the Identification of New Inhibitors and Their Evaluation as Potential Agents against Tauopathies and Tumors. J Med Chem 58:4590-609 (2015)  
Target
Name:
Tyrosine-protein kinase Fyn
Synonyms:
FYN Proto-oncogene Syn SLK Src-like kinase | p59-Fyn
Type:
Enzyme
Mol. Mass.:
60762.21
Organism:
Homo sapiens (Human)
Description:
P06241
Residue:
537
  
Inhibitor
Name:
BDBM50089523
Synonyms:
CHEMBL3578225
Type:
Small organic molecule
Emp. Form.:
C20H29N5O3S
Mol. Mass.:
419.541
SMILES:
CCOc1ccc(cc1)-c1[nH]ncc1CN1CCN(CC1)S(=O)(=O)N1CCCC1
: