Target
Estrogen receptor
Ligand
BDBM50089633
Substrate
Meas. Tech.
ChEMBL_1497344 (CHEMBL3579293)
IC50
3000±n/a nM
Citation
 Yang, CBalsells, JChu, HDCox, JMCrespo, AMa, XContino, LBrown, PGao, SZamlynny, BWiltsie, JClemas, JLisnock, JGibson, JZhou, GGarcia-Calvo, MBateman, TJTong, VXu, LCrook, MSinclair, PShen, HC Discovery of benzimidazole oxazolidinediones as novel and selective nonsteroidal mineralocorticoid receptor antagonists. ACS Med Chem Lett 6:461-5 (2015)  
Target
Name:
Estrogen receptor
Synonyms:
ER ESR ESR1_HUMAN Estrogen receptor Estrogen receptor (ER-alpha) Estrogen receptor alpha (ER) Nuclear receptor subfamily 3 group A member 1
Type:
Protein
Mol. Mass.:
66230.44
Organism:
Homo sapiens (Human)
Description:
P03372
Residue:
595
  
Inhibitor
Name:
BDBM50089633
Synonyms:
CHEMBL3578274
Type:
Small organic molecule
Emp. Form.:
C26H19F4N3O3
Mol. Mass.:
497.441
SMILES:
C[C@@H](N1C(=O)O[C@@](Cc2ccccc2)(C1=O)c1nc2cc(ccc2[nH]1)C(F)(F)F)c1ccc(F)cc1
: