Target
Carboxypeptidase B2
Ligand
BDBM50089745
Substrate
Meas. Tech.
ChEMBL_1496377 (CHEMBL3580143)
IC50
1000±n/a nM
Citation
 Halland, NBrönstrup, MCzech, JCzechtizky, WEvers, AFollmann, MKohlmann, MSchiell, MKurz, MSchreuder, HAKallus, C Novel Small Molecule Inhibitors of Activated Thrombin Activatable Fibrinolysis Inhibitor (TAFIa) from Natural Product Anabaenopeptin. J Med Chem 58:4839-44 (2015)  
Target
Name:
Carboxypeptidase B2
Synonyms:
CBPB2_HUMAN CPU Carboxypeptidase B2 isoform A Plasma carboxypeptidase B Thrombin-activable fibrinolysis inhibitor | pCPB
Type:
Enzyme
Mol. Mass.:
48432.74
Organism:
Homo sapiens (Human)
Description:
Q96IY4
Residue:
423
  
Inhibitor
Name:
BDBM50089745
Synonyms:
CHEMBL3577429
Type:
Small organic molecule
Emp. Form.:
C25H44N4O4
Mol. Mass.:
464.6413
SMILES:
CC1(C)C2CCC1(C)CC2NC(=O)[C@H](NC(=O)N[C@@H](CCCCN)C(O)=O)C1CCCCC1
: