Target
Protein mono-ADP-ribosyltransferase PARP10
Ligand
BDBM50089865
Substrate
Meas. Tech.
ChEMBL_1496979 (CHEMBL3579453)
IC50
2200±n/a nM
Citation
 Samain, FEkblad, TMikutis, GZhong, NZimmermann, MNauer, ABajic, DDecurtins, WScheuermann, JBrown, PJHall, JGräslund, SSchüler, HNeri, DFranzini, RM Tankyrase 1 Inhibitors with Drug-like Properties Identified by Screening a DNA-Encoded Chemical Library. J Med Chem 58:5143-9 (2015)  
Target
Name:
Protein mono-ADP-ribosyltransferase PARP10
Synonyms:
2.4.2.- ADP-ribosyltransferase diphtheria toxin-like 10 Human diphtheria toxin-like ADP-ribosyltransferase (ARTD10 or PARP10, L926Y)) Human diphtheria toxin-like ADP-ribosyltransferase (ARTD10 or PARP10, S927A)) PARP-10 Poly [ADP-ribose] polymerase 10
Type:
Mol. Mass.:
109953.63
Organism:
Homo sapiens (Human)
Description:
Q53GL7
Residue:
1025
  
Inhibitor
Name:
BDBM50089865
Synonyms:
CHEMBL3577624
Type:
Small organic molecule
Emp. Form.:
C20H18N6O4
Mol. Mass.:
406.3947
SMILES:
O=C(NCCc1nc(no1)-c1ccccn1)c1ccccc1N1CCC(=O)NC1=O
: