Target
Protein kinase C alpha type
Ligand
BDBM50258529
Substrate
Meas. Tech.
ChEMBL_1497523 (CHEMBL3582655)
Ki
0.480000±n/a nM
Citation
 Kedei, NKraft, MBKeck, GEHerald, CLMelody, NPettit, GRBlumberg, PM Neristatin 1 provides critical insight into bryostatin 1 structure-function relationships. J Nat Prod 78:896-900 (2015)  
Target
Name:
Protein kinase C alpha type
Synonyms:
KPCA_HUMAN PKC alpha and beta-2 PKC-alpha PRKACA Protein Kinase C- alpha Protein kinase C alpha (PKCa) Protein kinase C alpha type (PRKCA) RAF proto-oncogene serine/threonine-protein kinase
Type:
Enzyme
Mol. Mass.:
76755.65
Organism:
Homo sapiens (Human)
Description:
The recombinant human PKC enzymes were produced using a baculovirus expression system in SF9 cells
Residue:
672
  
Inhibitor
Name:
BDBM50258529
Synonyms:
CHEMBL449158 | bryostatin 1
Type:
Small organic molecule
Emp. Form.:
C47H68O17
Mol. Mass.:
905.0326
SMILES:
CCC\C=C\C=C\C(=O)O[C@H]1\C(C[C@H]2C[C@@H](OC(=O)C[C@H](O)C[C@@H]3C[C@H](OC(C)=O)C(C)(C)[C@](O)(C[C@@H]4C\C(C[C@@H](O4)\C=C\C(C)(C)[C@]1(O)O2)=C\C(=O)OC)O3)[C@@H](C)O)=C\C(=O)OC
: