Target
Nuclear receptor ROR-gamma
Ligand
BDBM50090094
Substrate
Meas. Tech.
ChEMBL_1497540 (CHEMBL3582672)
EC50
9.0±n/a nM
Citation
 René, OFauber, BPBoenig, Gde LBurton, BEidenschenk, CEverett, CGobbi, AHymowitz, SGJohnson, ARKiefer, JRLiimatta, MLockey, PNorman, MOuyang, WWallweber, HAWong, H Minor Structural Change to Tertiary Sulfonamide RORc Ligands Led to Opposite Mechanisms of Action. ACS Med Chem Lett 6:276-81 (2015)  
Target
Name:
Nuclear receptor ROR-gamma
Synonyms:
NR1F3 Nuclear receptor ROR-gamma (RORC) RAR-related orphan receptor C (RORc) RORG RZRG Retinoid-related orphan receptor-gamma (RORc)
Type:
Enzyme Catalytic Domain
Mol. Mass.:
58218.40
Organism:
Homo sapiens (Human)
Description:
P51449
Residue:
518
  
Inhibitor
Name:
BDBM50090094
Synonyms:
CHEMBL3581541 | US9216988, 89
Type:
Small organic molecule
Emp. Form.:
C24H29ClFN3O3S
Mol. Mass.:
494.022
SMILES:
CC(=O)N1CCN(CC1)c1ccc(CN(C2CCC2)S(=O)(=O)Cc2cccc(Cl)c2)c(F)c1
: