Target
Glucocorticoid receptor
Ligand
BDBM50091043
Substrate
Meas. Tech.
ChEMBL_1499886 (CHEMBL3583218)
IC50
128±n/a nM
Citation
 Eda, MKuroda, TKaneko, SAoki, YYamashita, MOkumura, CIkeda, YOhbora, TSakaue, MKoyama, NAritomo, K Synthesis and Biological Evaluation of Cyclopentaquinoline Derivatives as Nonsteroidal Glucocorticoid Receptor Antagonists. J Med Chem 58:4918-26 (2015)  
Target
Name:
Glucocorticoid receptor
Synonyms:
GCR_HUMAN GRL Glucocorticoid receptor (GRFP) Nuclear receptor subfamily 3 group C member 1
Type:
Enzyme
Mol. Mass.:
85656.87
Organism:
Homo sapiens (Human)
Description:
P04150
Residue:
777
  
Inhibitor
Name:
BDBM50091043
Synonyms:
CHEMBL3582115
Type:
Small organic molecule
Emp. Form.:
C21H27N3O
Mol. Mass.:
337.4586
SMILES:
Cc1cnn(C)c1-c1cc2c(NC(C)(C)C(=O)C2(C)C)c2CCCc12
: