Target
Glucocorticoid receptor
Ligand
BDBM50091050
Substrate
Meas. Tech.
ChEMBL_1499884 (CHEMBL3583216)
Ki
151±n/a nM
Citation
 Eda, MKuroda, TKaneko, SAoki, YYamashita, MOkumura, CIkeda, YOhbora, TSakaue, MKoyama, NAritomo, K Synthesis and Biological Evaluation of Cyclopentaquinoline Derivatives as Nonsteroidal Glucocorticoid Receptor Antagonists. J Med Chem 58:4918-26 (2015)  
Target
Name:
Glucocorticoid receptor
Synonyms:
GCR_HUMAN GRL Glucocorticoid receptor (GRFP) Nuclear receptor subfamily 3 group C member 1
Type:
Enzyme
Mol. Mass.:
85656.87
Organism:
Homo sapiens (Human)
Description:
P04150
Residue:
777
  
Inhibitor
Name:
BDBM50091050
Synonyms:
CHEMBL3582124
Type:
Small organic molecule
Emp. Form.:
C25H26N2O
Mol. Mass.:
370.4867
SMILES:
CC1(C)Nc2c3CCCc3c(cc2C(C)(C)C1=O)-c1ccnc2ccccc12
: