Target
Mineralocorticoid receptor
Ligand
BDBM50091034
Substrate
Meas. Tech.
ChEMBL_1499890 (CHEMBL3583484)
Ki
>3333±n/a nM
Citation
 Eda, MKuroda, TKaneko, SAoki, YYamashita, MOkumura, CIkeda, YOhbora, TSakaue, MKoyama, NAritomo, K Synthesis and Biological Evaluation of Cyclopentaquinoline Derivatives as Nonsteroidal Glucocorticoid Receptor Antagonists. J Med Chem 58:4918-26 (2015)  
Target
Name:
Mineralocorticoid receptor
Synonyms:
MCR MLR NR3C2 | Nuclear receptor subfamily 3 group C member 2
Type:
Enzyme
Mol. Mass.:
107076.42
Organism:
Homo sapiens (Human)
Description:
P08235
Residue:
984
  
Inhibitor
Name:
BDBM50091034
Synonyms:
CHEMBL3582121
Type:
Small organic molecule
Emp. Form.:
C22H24N4O
Mol. Mass.:
360.4522
SMILES:
CC1(C)Nc2c3CCCc3c(cc2C(C)(C)C1=O)-c1cncc2nccn12
: