Target
Androgen receptor
Ligand
BDBM50091046
Substrate
Meas. Tech.
ChEMBL_1499893 (CHEMBL3583487)
Ki
>2300±n/a nM
Citation
 Eda, MKuroda, TKaneko, SAoki, YYamashita, MOkumura, CIkeda, YOhbora, TSakaue, MKoyama, NAritomo, K Synthesis and Biological Evaluation of Cyclopentaquinoline Derivatives as Nonsteroidal Glucocorticoid Receptor Antagonists. J Med Chem 58:4918-26 (2015)  
Target
Name:
Androgen receptor
Synonyms:
ANDR_HUMAN Androgen Receptor Androgen receptor/Baculoviral IAP repeat-containing protein 2 Dihydrotestosterone receptor Nuclear receptor subfamily 3 group C member 4
Type:
Receptor
Mol. Mass.:
99185.27
Organism:
Homo sapiens (Human)
Description:
CHO cells were stably transfected with human AR gene.
Residue:
920
  
Inhibitor
Name:
BDBM50091046
Synonyms:
CHEMBL3582112
Type:
Small organic molecule
Emp. Form.:
C21H26N2O2
Mol. Mass.:
338.4433
SMILES:
Cc1noc(C)c1-c1cc2c(NC(C)(C)C(=O)C2(C)C)c2CCCc12
: