Target
Cytochrome P450 1A2
Ligand
BDBM50091324
Substrate
Meas. Tech.
ChEMBL_1497731 (CHEMBL3582737)
IC50
>100000±n/a nM
Citation
 Ai, YHu, YKang, FLai, YJia, YHuang, ZPeng, SJi, HTian, JZhang, Y Synthesis and Biological Evaluation of Novel Olean-28,13ß-lactams as Potential Antiprostate Cancer Agents. J Med Chem 58:4506-20 (2015)  
Target
Name:
Cytochrome P450 1A2
Synonyms:
CP1A2_HUMAN CYPIA2 Cytochrome P(3)450 Cytochrome P450 1A2 (CYP1A2) Cytochrome P450-P3
Type:
Enzyme
Mol. Mass.:
58423.38
Organism:
Homo sapiens (Human)
Description:
P05177
Residue:
516
  
Inhibitor
Name:
BDBM50091324
Synonyms:
CHEMBL3582240
Type:
Small organic molecule
Emp. Form.:
C37H50N2O3
Mol. Mass.:
570.8045
SMILES:
[H][C@@]12CC(C)(C)CC[C@]11CC[C@]3(C)[C@]2(N(C2CCCCC2)C1=O)C(=O)C=C1[C@@]2(C)C=C(C#N)C(=O)C(C)(C)[C@]2([H])CC[C@@]31C
: