Target
Nischarin
Ligand
BDBM50091344
Substrate
Meas. Tech.
ChEMBL_1497761 (CHEMBL3583020)
Ki
155±n/a nM
Citation
 Del Bello, FBargelli, VCifani, CGratteri, PBazzicalupi, CDiamanti, EGiannella, MMammoli, VMatucci, RMicioni Di Bonaventura, MVPiergentili, AQuaglia, WPigini, M Antagonism/Agonism modulation to build novel antihypertensives selectively triggering i1-imidazoline receptor activation. ACS Med Chem Lett 6:496-501 (2015)  
Target
Name:
Nischarin
Synonyms:
Imidazoline I1 Nisch | Nischarin
Type:
Enzyme Catalytic Domain
Mol. Mass.:
166460.59
Organism:
RAT
Description:
Q4G017
Residue:
1502
  
Inhibitor
Name:
BDBM50091344
Synonyms:
CHEMBL3582258
Type:
Small organic molecule
Emp. Form.:
C18H20N2
Mol. Mass.:
264.3648
SMILES:
CC(Cc1ccccc1-c1ccccc1)C1=NCCN1
: