Target
Steroid 17-alpha-hydroxylase/17,20 lyase
Ligand
BDBM50092139
Substrate
Meas. Tech.
ChEMBL_1498855 (CHEMBL3583829)
IC50
>10000±n/a nM
Target
Name:
Steroid 17-alpha-hydroxylase/17,20 lyase
Synonyms:
CP17A_HUMAN CYP17A1 Cytochrome P450 17A1 Cytochrome P450 C17 (CYP17) Cytochrome P450-C17 P450-C17 Steroid 17-alpha-Monooxygenase (CYP17) Steroid 17-alpha-monooxygenase | cytochrome P450 monooxygenase 17 alpha hydroxylase/17,20-lyase (CYP17)
Type:
Enzyme
Mol. Mass.:
57382.42
Organism:
Homo sapiens (Human)
Description:
E.coli expressing human CYP17
Residue:
508
  
Inhibitor
Name:
BDBM50092139
Synonyms:
CHEMBL3582472
Type:
Small organic molecule
Emp. Form.:
C15H10F3N3
Mol. Mass.:
289.2552
SMILES:
Fc1cncc(c1)-c1nc2cc(F)c(F)cc2n1C1CC1
: