Target
Steroid 21-hydroxylase
Ligand
BDBM50092142
Substrate
Meas. Tech.
ChEMBL_1498865 (CHEMBL3583945)
IC50
>10000±n/a nM
Target
Name:
Steroid 21-hydroxylase
Synonyms:
CP21A_HUMAN CYP21A2 Cytochrome P450 21 | Cytochrome P450 21A2
Type:
PROTEIN
Mol. Mass.:
55896.25
Organism:
Homo sapiens (Human)
Description:
ChEMBL_1498865
Residue:
494
  
Inhibitor
Name:
BDBM50092142
Synonyms:
CHEMBL3582477
Type:
Small organic molecule
Emp. Form.:
C18H17F2N3O
Mol. Mass.:
329.3439
SMILES:
CC(C)(O)c1cncc(c1)-c1nc2cc(F)c(F)cc2n1C1CC1
: