Target
Adenosine receptor A2a
Ligand
BDBM50092291
Substrate
Meas. Tech.
ChEMBL_1499918 (CHEMBL3583512)
Ki
>1000±n/a nM
Citation
 Baraldi, PGBaraldi, SSaponaro, GAghazadeh Tabrizi, MRomagnoli, RRuggiero, EVincenzi, FBorea, PAVarani, K One-pot reaction to obtain N,N'-disubstituted guanidines of pyrazolo[4,3-e][1,2,4]triazolo[1,5-c]pyrimidine scaffold as human A3 adenosine receptor antagonists. J Med Chem 58:5355-60 (2015)  
Target
Name:
Adenosine receptor A2a
Synonyms:
A2A adenosine receptor (hA2A) ADENOSINE A2 ADORA2 Adenosine A2A receptor (A2AAR)
Type:
G Protein-Coupled Receptor (GPCR)
Mol. Mass.:
44716.46
Organism:
Homo sapiens (Human)
Description:
P29274
Residue:
412
  
Inhibitor
Name:
BDBM50092291
Synonyms:
CHEMBL3581307
Type:
Small organic molecule
Emp. Form.:
C24H17Cl2N9O
Mol. Mass.:
518.357
SMILES:
[#6]-n1cc2c(n1)nc(\[#7]=[#6](/[#7]-c1cccc(Cl)c1)-[#7]-c1cccc(Cl)c1)n1nc(nc21)-c1ccco1
: