Target
Cholinesterase
Ligand
BDBM50092533
Substrate
Meas. Tech.
ChEMBL_1500867 (CHEMBL3588507)
Ki
4880±n/a nM
Citation
 Nguyen, VTTo, DCTran, MHOh, SHKim, JAAli, MYWoo, MHChoi, JSMin, BS Isolation of cholinesterase andß-secretase 1 inhibiting compounds from Lycopodiella cernua. Bioorg Med Chem 23:3126-34 (2015)  
Target
Name:
Cholinesterase
Synonyms:
Acylcholine acylhydrolase Butyrylcholine esterase (BChE) Butyrylcholinesterase (BuChE) CHLE_HUMAN Cholinesterases Pseudocholinesterase
Type:
Homotetramer
Mol. Mass.:
68422.27
Organism:
Homo sapiens (Human)
Description:
P06276
Residue:
602
  
Inhibitor
Name:
BDBM50092533
Synonyms:
CHEMBL3586201
Type:
Small organic molecule
Emp. Form.:
C30H50O2
Mol. Mass.:
442.7168
SMILES:
[H][C@]12CC[C@@]3([H])[C@@](C)(CC[C@@]4([H])C(C)(C)[C@H](O)CC[C@]34C)CC1=CC[C@@]1([H])C(C)(C)[C@@H](O)CC[C@]21C
: