Target
Metallo-beta-lactamase L1 type 3
Ligand
BDBM50092978
Substrate
Meas. Tech.
ChEMBL_1500319 (CHEMBL3588630)
Ki
410±n/a nM
Citation
 Liu, XLShi, YKang, JSOelschlaeger, PYang, KW Amino Acid Thioester Derivatives: A Highly Promising Scaffold for the Development of Metallo-ß-lactamase L1 Inhibitors. ACS Med Chem Lett 6:660-4 (2015)  
Target
Name:
Metallo-beta-lactamase L1 type 3
Synonyms:
BLA1_STEMA | Beta-lactamase L1
Type:
PROTEIN
Mol. Mass.:
30803.13
Organism:
Stenotrophomonas maltophilia
Description:
ChEMBL_1500319
Residue:
290
  
Inhibitor
Name:
BDBM50092978
Synonyms:
CHEMBL3586475
Type:
Small organic molecule
Emp. Form.:
C11H13NO4S2
Mol. Mass.:
287.355
SMILES:
C[C@H](NC(=O)Cc1cccs1)C(=O)SCC(O)=O
: