Target
Nitric oxide synthase, brain
Ligand
BDBM50093349
Substrate
Meas. Tech.
ChEMBL_1500371 (CHEMBL3587004)
Ki
55±n/a nM
Citation
 Kang, SLi, HTang, WMartásek, PRoman, LJPoulos, TLSilverman, RB 2-Aminopyridines with a Truncated Side Chain To Improve Human Neuronal Nitric Oxide Synthase Inhibitory Potency and Selectivity. J Med Chem 58:5548-60 (2015)  
Target
Name:
Nitric oxide synthase, brain
Synonyms:
Constitutive NOS NC-NOS NOS type I nNOS NOS1_HUMAN Neuronal nitric oxide synthase Nitric oxide synthase, neuronal (nNOS) bNOS | nNOS
Type:
Homodimer
Mol. Mass.:
160985.98
Organism:
Homo sapiens (Human)
Description:
P29475
Residue:
1434
  
Inhibitor
Name:
BDBM50093349
Synonyms:
CHEMBL3586664 | US9951014, Name 19c
Type:
Small organic molecule
Emp. Form.:
C19H25N5
Mol. Mass.:
323.4353
SMILES:
CNCCN(C)c1cc(CCc2cc(C)cc(N)n2)cc(c1)C#N
: