Target
ATPase family AAA domain-containing protein 2
Ligand
BDBM50096321
Substrate
Meas. Tech.
ChEMBL_1500426 (CHEMBL3587157)
IC50
3162±n/a nM
Citation
 Demont, EHChung, CWFurze, RCGrandi, PMichon, AMWellaway, CBarrett, NBridges, AMCraggs, PDDiallo, HDixon, DPDouault, CEmmons, AJJones, EJKaramshi, BVLocke, KMitchell, DJMouzon, BHPrinjha, RKRoberts, ADSheppard, RJWatson, RJBamborough, P Fragment-Based Discovery of Low-Micromolar ATAD2 Bromodomain Inhibitors. J Med Chem 58:5649-73 (2015)  
Target
Name:
ATPase family AAA domain-containing protein 2
Synonyms:
AAA nuclear coregulator cancer-associated protein ATAD2 PRO2000
Type:
PROTEIN
Mol. Mass.:
158546.30
Organism:
Homo sapiens (Human)
Description:
ChEMBL_1500426
Residue:
1390
  
Inhibitor
Name:
BDBM50096321
Synonyms:
CHEMBL3586720
Type:
Small organic molecule
Emp. Form.:
C24H27N5O2
Mol. Mass.:
417.5035
SMILES:
CC(=O)N1CCc2cc(ccc12)-c1cnc(NC2CCNCC2)c2[nH]c(=O)c(C)cc12
: