Target
Peroxisome proliferator-activated receptor gamma
Ligand
BDBM50093472
Substrate
Meas. Tech.
ChEMBL_1501030 (CHEMBL3587211)
EC50
0.380000±n/a nM
Citation
 Garcia-Vallvé, SGuasch, LTomas-Hernández, Sdel Bas, JMOllendorff, VArola, LPujadas, GMulero, M Peroxisome Proliferator-Activated Receptor¿ (PPAR¿) and Ligand Choreography: Newcomers Take the Stage. J Med Chem 58:5381-94 (2015)  
Target
Name:
Peroxisome proliferator-activated receptor gamma
Synonyms:
NR1C3 PPAR-gamma PPARG_HUMAN Peroxisome proliferator-activated receptor gamma (PPAR gamma) Peroxisome proliferator-activated receptor gamma (PPARγ) peroxisome proliferator-activated receptor gamma isoform 2
Type:
Nuclear Receptor
Mol. Mass.:
57613.46
Organism:
Homo sapiens (Human)
Description:
P37231
Residue:
505
  
Inhibitor
Name:
BDBM50093472
Synonyms:
CHEMBL3585575
Type:
Small organic molecule
Emp. Form.:
C33H35N3O9
Mol. Mass.:
617.6457
SMILES:
CC[C@@H](OC(=O)N(Cc1ccccc1)C(=O)Nc1cc(OC)cc(OC)c1)c1cc(no1)-c1ccc(OC(C)(C)C(O)=O)cc1
: