Target
Plasminogen
Ligand
BDBM50093549
Substrate
Meas. Tech.
ChEMBL_1501456 (CHEMBL3588562)
IC50
130000±n/a nM
Citation
 Teno, NGohda, KWanaka, KTsuda, YAkagawa, MAkiduki, EAraki, MMasuda, AOtsubo, TYamashita, Y Novel type of plasmin inhibitors: providing insight into P4 moiety and alternative scaffold to pyrrolopyrimidine. Bioorg Med Chem 23:3696-704 (2015)  
Target
Name:
Plasminogen
Synonyms:
Activation peptide PLG Plasmin Plasmin heavy chain A, short form | Plasmin light chain B
Type:
Enzyme
Mol. Mass.:
90579.18
Organism:
Homo sapiens (Human)
Description:
Residue:
810
  
Inhibitor
Name:
BDBM50093549
Synonyms:
CHEMBL3585738
Type:
Small organic molecule
Emp. Form.:
C26H27N9O5
Mol. Mass.:
545.5499
SMILES:
Cn1c(CN2C(=O)CN(C2=O)c2ccc3n(C)c(=O)oc3c2)cc2cnc(nc12)C(=O)N[C@@H](CCCCN)C#N
: