Target
72 kDa type IV collagenase
Ligand
BDBM8465
Substrate
Meas. Tech.
ChEMBL_1501467 (CHEMBL3588573)
Ki
20±n/a nM
Citation
 Behrends, MWagner, SKopka, KSchober, OSchäfers, MKumbhar, SWaller, MHaufe, G New matrix metalloproteinase inhibitors based on¿-fluorinateda-aminocarboxylic anda-aminohydroxamic acids. Bioorg Med Chem 23:3809-18 (2015)  
Target
Name:
72 kDa type IV collagenase
Synonyms:
72 kDa gelatinase CLG4A Gelatinase A (MMP-2) MMP2_HUMAN Matrix metalloproteinase-2 (MMP 2) Matrix metalloproteinases 2 (MMP-2) | TBE-1
Type:
Enzyme
Mol. Mass.:
73870.36
Organism:
Homo sapiens (Human)
Description:
P08253
Residue:
660
  
Inhibitor
Name:
BDBM8465
Synonyms:
(2R)-N-hydroxy-2-[(4-methoxybenzene)(pyridin-3-ylmethyl)sulfonamido]-3-methylbutanamide CGS 27023 CHEMBL514138 | hydroxamate analogue 1
Type:
Small organic molecule
Emp. Form.:
C18H23N3O5S
Mol. Mass.:
393.457
SMILES:
COc1ccc(cc1)S(=O)(=O)N(Cc1cccnc1)[C@H](C(C)C)C(=O)NO
: