Target
N-formyl peptide receptor 2
Ligand
BDBM50097567
Substrate
Meas. Tech.
ChEMBL_1504343 (CHEMBL3592680)
EC50
96±n/a nM
Citation
 Lacivita, ESchepetkin, IAStama, MLKirpotina, LNColabufo, NAPerrone, RKhlebnikov, AIQuinn, MTLeopoldo, M Novel 3-(1H-indol-3-yl)-2-[3-(4-methoxyphenyl)ureido]propanamides as selective agonists of human formyl-peptide receptor 2. Bioorg Med Chem 23:3913-24 (2015)  
Target
Name:
N-formyl peptide receptor 2
Synonyms:
ALXR, FPRL1, FPR2 FPR2 FPRH1 Formyl Peptide Receptor-Like 1 LXA4 receptor Lipoxin A4 receptor RFP | hFPRL
Type:
G Protein-Coupled Receptor (GPCR)
Mol. Mass.:
38968.35
Organism:
Homo sapiens (Human)
Description:
P25090
Residue:
351
  
Inhibitor
Name:
BDBM50097567
Synonyms:
CHEMBL3588871
Type:
Small organic molecule
Emp. Form.:
C32H37N5O4
Mol. Mass.:
555.6673
SMILES:
COc1ccc(NC(=O)N[C@@H](Cc2c[nH]c3ccccc23)C(=O)NCC2(CCCCC2)c2ccc(OC)cn2)cc1
: