Target
Phosphatidylinositol 4,5-bisphosphate 3-kinase catalytic subunit beta isoform
Ligand
BDBM50094474
Substrate
Meas. Tech.
ChEMBL_1504095 (CHEMBL3591469)
IC50
1700±n/a nM
Citation
 Barlaam, BCosulich, SFitzek, MGreen, SHarris, CSHudson, KLambert-van der Brempt, COuvry, GPage, KRuston, LWard, LDelouvrié, B Design of selective PI3Ka inhibitors starting from a promiscuous pan kinase scaffold. Bioorg Med Chem Lett 25:2679-85 (2015)  
Target
Name:
Phosphatidylinositol 4,5-bisphosphate 3-kinase catalytic subunit beta isoform
Synonyms:
PI3-kinase p110 subunit beta PI3Kbeta PIK3CB Phosphatidylinositol 4,5-bisphosphate 3-kinase catalytic subunit beta (PI3Kbeta) Phosphatidylinositol 4,5-bisphosphate 3-kinase catalytic subunit beta isoform (PI3K) Phosphatidylinositol 4,5-bisphosphate 3-kinase catalytic subunit beta isoform (PI3Kbeta) Phosphatidylinositol-4,5-bisphosphate 3-kinase catalytic subunit beta isoform Phosphoinositide 3-Kinase (PI3K), beta Chain A PtdIns-3-kinase p110
Type:
Enzyme Subunit
Mol. Mass.:
122769.00
Organism:
Homo sapiens (Human)
Description:
P42338
Residue:
1070
  
Inhibitor
Name:
BDBM50094474
Synonyms:
CHEMBL3590220
Type:
Small organic molecule
Emp. Form.:
C22H26N10O
Mol. Mass.:
446.5082
SMILES:
CN(C)CC(=O)N1CCC(CC1)n1ccc(n1)-c1cnc(N)c(n1)-n1nnc2ccccc12
: