Target
Phosphatidylinositol 4,5-bisphosphate 3-kinase catalytic subunit alpha isoform
Ligand
BDBM50094477
Substrate
Meas. Tech.
ChEMBL_1504097 (CHEMBL3591471)
IC50
3900±n/a nM
Citation
 Barlaam, BCosulich, SFitzek, MGreen, SHarris, CSHudson, KLambert-van der Brempt, COuvry, GPage, KRuston, LWard, LDelouvrié, B Design of selective PI3Ka inhibitors starting from a promiscuous pan kinase scaffold. Bioorg Med Chem Lett 25:2679-85 (2015)  
Target
Name:
Phosphatidylinositol 4,5-bisphosphate 3-kinase catalytic subunit alpha isoform
Synonyms:
P42336 PI3-kinase subunit p110-alpha PIK3CA Phosphatidylinositol 3-kinase alpha (PI3Kalpha) Phosphatidylinositol 4,5-bisphosphate 3-kinase (PI3K) Phosphatidylinositol 4,5-bisphosphate 3-kinase catalytic subunit alpha (PI3Kalpha) Phosphatidylinositol 4,5-bisphosphate 3-kinase catalytic subunit alpha isoform (PI3-Ka) Phosphatidylinositol 4,5-bisphosphate 3-kinase catalytic subunit alpha isoform (PI3K p110alpha) Phosphatidylinositol 4,5-bisphosphate 3-kinase catalytic subunit alpha isoform (PI3K-alpha) Phosphatidylinositol 4,5-bisphosphate 3-kinase catalytic subunit alpha isoform (PI3Kalpha p110alpha) Phosphatidylinositol 4,5-bisphosphate 3-kinase catalytic subunit alpha isoform (PIK3CA) Phosphatidylinositol-4,5-bisphosphate 3-kinase catalytic subunit alpha isoform Phosphoinositide 3-Kinase (PI3K), alpha Chain A Phosphoinositide 3-kinases (PI3K) PtdIns-3-kinase p110 | p110 alpha
Type:
Enzyme Subunit
Mol. Mass.:
124294.87
Organism:
Homo sapiens (Human)
Description:
P42336
Residue:
1068
  
Inhibitor
Name:
BDBM50094477
Synonyms:
CHEMBL3590223
Type:
Small organic molecule
Emp. Form.:
C22H27N11O
Mol. Mass.:
461.5229
SMILES:
CN(C)CC(=O)N1CCC(CC1)c1nc(nn1C)-c1cnc(N)c(n1)-n1nnc2ccccc12
: