Target
Acetylcholinesterase
Ligand
BDBM10404
Substrate
Meas. Tech.
ChEMBL_1504214 (CHEMBL3591974)
Ki
540±n/a nM
Citation
 Heller, LSchwarz, SObernauer, ACsuk, R Allobetulin derived seco-oleananedicarboxylates act as inhibitors of acetylcholinesterase. Bioorg Med Chem Lett 25:2654-6 (2015)  
Target
Name:
Acetylcholinesterase
Synonyms:
ACES_ELEEL Acetylcholinesterase (EeAChE) | ache
Type:
Enzyme
Mol. Mass.:
71812.79
Organism:
Electrophorus electricus (Electric eel)
Description:
Residue:
633
  
Inhibitor
Name:
BDBM10404
Synonyms:
(1S,12S,14R)-9-methoxy-4-methyl-11-oxa-4-azatetracyclo[8.6.1.0^{1,12}.0^{6,17}]heptadeca-6,8,10(17),15-tetraen-14-ol GALANTAMINE HYDROBROMIDE Galanthamine Lycoremine Nivaline Reminyl US9586925, Galantamine | galantamine
Type:
Small organic molecule
Emp. Form.:
C17H21NO3
Mol. Mass.:
287.3535
SMILES:
COc1ccc2CN(C)CC[C@@]34C=C[C@H](O)C[C@@H]3Oc1c24
: