Target
Poly [ADP-ribose] polymerase 1
Ligand
BDBM50094941
Substrate
Meas. Tech.
ChEMBL_1502966 (CHEMBL3591900)
IC50
2000±n/a nM
Citation
 Kumpan, KNathubhai, AZhang, CWood, PJLloyd, MDThompson, ASHaikarainen, TLehtiö, LThreadgill, MD Structure-based design, synthesis and evaluation in vitro of arylnaphthyridinones, arylpyridopyrimidinones and their tetrahydro derivatives as inhibitors of the tankyrases. Bioorg Med Chem 23:3013-32 (2015)  
Target
Name:
Poly [ADP-ribose] polymerase 1
Synonyms:
(ARTD1 or PARP1) 2.4.2.30 ADPRT ARTD1 Human diphtheria toxin-like ADP-ribosyltransferase (ARTD1 or PARP1) NT-PARP-1 PARP1 PPOL Poly [ADP-ribose] polymerase 1 (PARP) Poly [ADP-ribose] polymerase 1 (PARP1) Poly [ADP-ribose] polymerase 1, 28-kDa form Poly [ADP-ribose] polymerase 1, processed C-terminus Poly [ADP-ribose] polymerase-1 Poly(ADP-ribose) polymerase-1 (ARTD1/PARP1) Protein poly-ADP-ribosyltransferase PARP1 | Synonyms=ADPRT
Type:
Mol. Mass.:
113114.22
Organism:
Homo sapiens (Human)
Description:
P09874
Residue:
1014
  
Inhibitor
Name:
BDBM50094941
Synonyms:
CHEMBL3589285
Type:
Small organic molecule
Emp. Form.:
C15H15BrN2O
Mol. Mass.:
319.196
SMILES:
CN1CCCc2c1cc([nH]c2=O)-c1ccc(Br)cc1
: