Target
Inhibin beta A chain
Ligand
BDBM50095122
Substrate
Meas. Tech.
ChEMBL_1503623 (CHEMBL3591943)
IC50
3670±n/a nM
Citation
 Zhu, JMishra, RKSchiltz, GEMakanji, YScheidt, KAMazar, APWoodruff, TK Virtual High-Throughput Screening To Identify Novel Activin Antagonists. J Med Chem 58:5637-48 (2015)  
Target
Name:
Inhibin beta A chain
Synonyms:
Activin beta-A chain Inhba | Inhibin beta A chain
Type:
PROTEIN
Mol. Mass.:
47403.32
Organism:
Mus musculus
Description:
ChEMBL_109823
Residue:
424
  
Inhibitor
Name:
BDBM50095122
Synonyms:
CHEMBL3589518
Type:
Small organic molecule
Emp. Form.:
C25H25N5O3
Mol. Mass.:
443.4977
SMILES:
CCn1c(nc2cc(NC(=O)COC)cc(C(=O)NCc3ccccc3)c12)-c1cccnc1
: