Target
Cannabinoid receptor 1
Ligand
BDBM50095881
Substrate
Meas. Tech.
ChEMBL_1502233 (CHEMBL3591169)
IC50
>10000±n/a nM
Citation
 Han, SZhang, FFQian, HYChen, LLPu, JBXie, XChen, JZ Development of Quinoline-2,4(1H,3H)-diones as Potent and Selective Ligands of the Cannabinoid Type 2 Receptor. J Med Chem 58:5751-69 (2015)  
Target
Name:
Cannabinoid receptor 1
Synonyms:
CANN6 CB-R CNR CNR1_HUMAN Cannabinoid receptor Cannabinoid receptor 1 (brain)
Type:
G Protein-Coupled Receptor (GPCR)
Mol. Mass.:
52868.96
Organism:
Homo sapiens (Human)
Description:
P21554
Residue:
472
  
Inhibitor
Name:
BDBM50095881
Synonyms:
CHEMBL3590641
Type:
Small organic molecule
Emp. Form.:
C22H30N2O3
Mol. Mass.:
370.4852
SMILES:
CCCCCN1C(=O)\C(=C\NC2CCCCC2)C(=O)c2cc(OC)ccc12
: