Target
Cannabinoid receptor 2
Ligand
BDBM50095882
Substrate
Meas. Tech.
ChEMBL_1502234 (CHEMBL3591170)
IC50
>10000±n/a nM
Citation
 Han, SZhang, FFQian, HYChen, LLPu, JBXie, XChen, JZ Development of Quinoline-2,4(1H,3H)-diones as Potent and Selective Ligands of the Cannabinoid Type 2 Receptor. J Med Chem 58:5751-69 (2015)  
Target
Name:
Cannabinoid receptor 2
Synonyms:
CANNABINOID CB2 CB2 CB2B CNR2_HUMAN Cannabinoid CB2 receptor Cannabinoid receptor 2 (CB2R) | hCB2
Type:
G Protein-Coupled Receptor (GPCR)
Mol. Mass.:
39690.94
Organism:
Homo sapiens (Human)
Description:
P34972
Residue:
360
  
Inhibitor
Name:
BDBM50095882
Synonyms:
CHEMBL3590642
Type:
Small organic molecule
Emp. Form.:
C23H32N2O3
Mol. Mass.:
384.5118
SMILES:
CCCCCCN1C(=O)\C(=C\NC2CCCCC2)C(=O)c2cc(OC)ccc12
: