Target
Epidermal growth factor receptor
Ligand
BDBM50095952
Substrate
Meas. Tech.
ChEMBL_1505243 (CHEMBL3594868)
IC50
>1000±n/a nM
Citation
 Nakajima, YInoue, TNakai, KMukoyoshi, KHamaguchi, HHatanaka, KSasaki, HTanaka, ATakahashi, FKunikawa, SUsuda, HMoritomo, AHigashi, YInami, MShirakami, S Synthesis and evaluation of novel 1H-pyrrolo[2,3-b]pyridine-5-carboxamide derivatives as potent and orally efficacious immunomodulators targeting JAK3. Bioorg Med Chem 23:4871-83 (2015)  
Target
Name:
Epidermal growth factor receptor
Synonyms:
EGF Receptor Substrate EGFR_HUMAN ERBB1 Epidermal Growth Factor Receptor erbB-1 Epidermal growth factor receptor (EGFR) HER1 Proto-oncogene c-ErbB-1 Tyrosine-Protein Kinase ErbB-1
Type:
Receptor Kinase Domain
Mol. Mass.:
134279.59
Organism:
Homo sapiens (Human)
Description:
P00533
Residue:
1210
  
Inhibitor
Name:
BDBM50095952
Synonyms:
CHEMBL3593777
Type:
Small organic molecule
Emp. Form.:
C19H18FN7O
Mol. Mass.:
379.3909
SMILES:
NC(=O)c1cnc2[nH]ccc2c1N[C@@H]1CCN(C[C@@H]1F)c1ccc(cn1)C#N
: