Target
Poly [ADP-ribose] polymerase 1
Ligand
BDBM27135
Substrate
Meas. Tech.
ChEMBL_1505691 (CHEMBL3594611)
IC50
5.0±n/a nM
Citation
 Abdullah, IChee, CFLee, YKThunuguntla, SSSatish Reddy, KNellore, KAntony, TVerma, JMun, KWOthman, SSubramanya, HRahman, NA Benzimidazole derivatives as potential dual inhibitors for PARP-1 and DHODH. Bioorg Med Chem 23:4669-80 (2015)  
Target
Name:
Poly [ADP-ribose] polymerase 1
Synonyms:
(ARTD1 or PARP1) 2.4.2.30 ADPRT ARTD1 Human diphtheria toxin-like ADP-ribosyltransferase (ARTD1 or PARP1) NT-PARP-1 PARP1 PPOL Poly [ADP-ribose] polymerase 1 (PARP) Poly [ADP-ribose] polymerase 1 (PARP1) Poly [ADP-ribose] polymerase 1, 28-kDa form Poly [ADP-ribose] polymerase 1, processed C-terminus Poly [ADP-ribose] polymerase-1 Poly(ADP-ribose) polymerase-1 (ARTD1/PARP1) Protein poly-ADP-ribosyltransferase PARP1 | Synonyms=ADPRT
Type:
Mol. Mass.:
113114.22
Organism:
Homo sapiens (Human)
Description:
P09874
Residue:
1014
  
Inhibitor
Name:
BDBM27135
Synonyms:
2-[(2R)-2-methylpyrrolidin-2-yl]-1H-1,3-benzodiazole-4-carboxamide benzimidazole carboxamide, 3a
Type:
Small organic molecule
Emp. Form.:
C13H16N4O
Mol. Mass.:
244.2923
SMILES:
C[C@@]1(CCCN1)c1nc2cccc(C(N)=O)c2[nH]1
: