Target
Aurora kinase A
Ligand
BDBM50096228
Substrate
Meas. Tech.
ChEMBL_1505871 (CHEMBL3595328)
Ki
>5400±n/a nM
Citation
 Rudolph, JAliagas, ICrawford, JJMathieu, SLee, WChao, QDong, PRouge, LWang, WHeise, CMurray, LJLa, HLiu, YManning, GDiederich, FHoeflich, KP Leveraging the Pre-DFG Residue Thr-406 To Obtain High Kinase Selectivity in an Aminopyrazole-Type PAK1 Inhibitor Series. ACS Med Chem Lett 6:711-5 (2015)  
Target
Name:
Aurora kinase A
Synonyms:
AIK ARK1 AURKA AYK1 Aurora kinase A (AURA) Aurora kinase A (Aurora A) Aurora-related kinase 1 BTAK Breast-tumor-amplified kinase STK15 Serine/threonine kinase 15 Serine/threonine-protein kinase aurora A hARK1
Type:
Serine/threonine-protein kinase
Mol. Mass.:
45830.98
Organism:
Homo sapiens (Human)
Description:
O14965
Residue:
403
  
Inhibitor
Name:
BDBM50096228
Synonyms:
CHEMBL3594175
Type:
Small organic molecule
Emp. Form.:
C21H22ClN9O
Mol. Mass.:
451.912
SMILES:
CN(Cc1ccc2[nH]cnc2c1Cl)c1nccc(Nc2cc([nH]n2)[C@H]2CCN(C)C2=O)n1
: