Target
Putative P2Y purinoceptor 10
Ligand
BDBM50096458
Substrate
Meas. Tech.
ChEMBL_1495909 (CHEMBL3579720)
EC50
1.7±n/a nM
Citation
 Ikubo, MInoue, ANakamura, SJung, SSayama, MOtani, YUwamizu, ASuzuki, KKishi, TShuto, AIshiguro, JOkudaira, MKano, KMakide, KAoki, JOhwada, T Structure-activity relationships of lysophosphatidylserine analogs as agonists of G-protein-coupled receptors GPR34, P2Y10, and GPR174. J Med Chem 58:4204-19 (2015)  
Target
Name:
Putative P2Y purinoceptor 10
Synonyms:
P2RY10 P2Y10 Putative P2Y purinoceptor 10
Type:
PROTEIN
Mol. Mass.:
38793.96
Organism:
Homo sapiens (Human)
Description:
ChEMBL_109762
Residue:
339
  
Inhibitor
Name:
BDBM50096458
Synonyms:
CHEMBL3577179
Type:
Small organic molecule
Emp. Form.:
C26H44NO9P
Mol. Mass.:
545.6026
SMILES:
CCCCCCCCCCCOc1ccccc1CCC(=O)OCCCOP(O)(=O)OC[C@H](N)C(O)=O
: