Target
Beta sliding clamp
Ligand
BDBM50096631
Substrate
Meas. Tech.
ChEMBL_1495912 (CHEMBL3579723)
IC50
888000±n/a nM
Citation
 Yin, ZWhittell, LRWang, YJergic, SMa, CLewis, PJDixon, NEBeck, JLKelso, MJOakley, AJ Bacterial Sliding Clamp Inhibitors that Mimic the Sequential Binding Mechanism of Endogenous Linear Motifs. J Med Chem 58:4693-702 (2015)  
Target
Name:
Beta sliding clamp
Synonyms:
Beta clamp DNA polymerase III subunit beta JW3678 | dnaN
Type:
PROTEIN
Mol. Mass.:
40578.60
Organism:
Escherichia coli (strain K12)
Description:
ChEMBL_109765
Residue:
366
  
Inhibitor
Name:
BDBM50096631
Synonyms:
CHEMBL3577275
Type:
Small organic molecule
Emp. Form.:
C15H15ClN2O3
Mol. Mass.:
306.744
SMILES:
NC(=O)Cn1c2C[C@H](CCc2c2cc(Cl)ccc12)C(O)=O
: