Target
Beta sliding clamp
Ligand
BDBM50096637
Substrate
Meas. Tech.
ChEMBL_1495912 (CHEMBL3579723)
Ki
246000±n/a nM
Citation
 Yin, ZWhittell, LRWang, YJergic, SMa, CLewis, PJDixon, NEBeck, JLKelso, MJOakley, AJ Bacterial Sliding Clamp Inhibitors that Mimic the Sequential Binding Mechanism of Endogenous Linear Motifs. J Med Chem 58:4693-702 (2015)  
Target
Name:
Beta sliding clamp
Synonyms:
Beta clamp DNA polymerase III subunit beta JW3678 | dnaN
Type:
PROTEIN
Mol. Mass.:
40578.60
Organism:
Escherichia coli (strain K12)
Description:
ChEMBL_109765
Residue:
366
  
Inhibitor
Name:
BDBM50096637
Synonyms:
CHEMBL3577269
Type:
Small organic molecule
Emp. Form.:
C13H12ClNO2
Mol. Mass.:
249.693
SMILES:
OC(=O)[C@H]1CCc2c(C1)[nH]c1ccc(Cl)cc21
: