Target
Serine/threonine-protein kinase PAK 4
Ligand
BDBM50097138
Substrate
Meas. Tech.
ChEMBL_1499558 (CHEMBL3584416)
Ki
1660±n/a nM
Citation
 Crawford, JJLee, WAliagas, IMathieu, SHoeflich, KPZhou, WWang, WRouge, LMurray, LLa, HLiu, NFan, PWCheong, JHeise, CERamaswamy, SMintzer, RLiu, YChao, QRudolph, J Structure-Guided Design of Group I Selective p21-Activated Kinase Inhibitors. J Med Chem 58:5121-36 (2015)  
Target
Name:
Serine/threonine-protein kinase PAK 4
Synonyms:
KIAA1142 PAK4_HUMAN | p21-Activated kinase 4 (PAK4)
Type:
Protein
Mol. Mass.:
64098.01
Organism:
Homo sapiens (Human)
Description:
O96013
Residue:
591
  
Inhibitor
Name:
BDBM50097138
Synonyms:
CHEMBL3580970
Type:
Small organic molecule
Emp. Form.:
C19H20N8
Mol. Mass.:
360.4157
SMILES:
Cn1cnc2cc(CNc3nccc(Nc4cc([nH]n4)C4CC4)n3)ccc12
: