Target
Rho-associated protein kinase 1
Ligand
BDBM50097169
Substrate
Meas. Tech.
ChEMBL_1499748 (CHEMBL3585197)
Ki
89±n/a nM
Citation
 Green, JCao, JBandarage, UKGao, HCourt, JMarhefka, CJacobs, MTaslimi, PNewsome, DNakayama, TShah, SRodems, S Design, Synthesis, and Structure-Activity Relationships of Pyridine-Based Rho Kinase (ROCK) Inhibitors. J Med Chem 58:5028-37 (2015)  
Target
Name:
Rho-associated protein kinase 1
Synonyms:
ROCK-I ROCK1_HUMAN Rho-associated protein kinase Rho-associated, coiled-coil-containing protein kinase 1 Rho-kinase (ROCK I) p160 ROCK-1 | p160ROCK
Type:
Serine/threonine-protein kinase
Mol. Mass.:
158156.77
Organism:
Homo sapiens (Human)
Description:
Q13464
Residue:
1354
  
Inhibitor
Name:
BDBM50097169
Synonyms:
CHEMBL3581135
Type:
Small organic molecule
Emp. Form.:
C16H14N4O2S
Mol. Mass.:
326.373
SMILES:
COc1cccc(CC(=O)Nc2nc(ns2)-c2ccncc2)c1
: