Target
cAMP-dependent protein kinase catalytic subunit alpha
Ligand
BDBM50097357
Substrate
Meas. Tech.
ChEMBL_1499749 (CHEMBL3585198)
Ki
2090±n/a nM
Citation
 Green, JCao, JBandarage, UKGao, HCourt, JMarhefka, CJacobs, MTaslimi, PNewsome, DNakayama, TShah, SRodems, S Design, Synthesis, and Structure-Activity Relationships of Pyridine-Based Rho Kinase (ROCK) Inhibitors. J Med Chem 58:5028-37 (2015)  
Target
Name:
cAMP-dependent protein kinase catalytic subunit alpha
Synonyms:
KAPCA_HUMAN PKACA cAMP-dependent protein kinase (PKA) cAMP-dependent protein kinase catalytic subunit alpha cAMP-dependent protein kinase catalytic subunit alpha (PKACA) cAMP-dependent protein kinase catalytic subunit alpha isoform 1 | cAMP-dependent protein kinase, alpha-catalytic subunit
Type:
Enzyme Catalytic Subunit
Mol. Mass.:
40598.73
Organism:
Homo sapiens (Human)
Description:
Residue:
351
  
Inhibitor
Name:
BDBM50097357
Synonyms:
CHEMBL3581117
Type:
Small organic molecule
Emp. Form.:
C16H12FN3OS
Mol. Mass.:
313.349
SMILES:
Fc1ccccc1CC(=O)Nc1nc(cs1)-c1ccncc1
: