Target
Rho-associated protein kinase 1
Ligand
BDBM50097151
Substrate
Meas. Tech.
ChEMBL_1499748 (CHEMBL3585197)
Ki
45±n/a nM
Citation
 Green, JCao, JBandarage, UKGao, HCourt, JMarhefka, CJacobs, MTaslimi, PNewsome, DNakayama, TShah, SRodems, S Design, Synthesis, and Structure-Activity Relationships of Pyridine-Based Rho Kinase (ROCK) Inhibitors. J Med Chem 58:5028-37 (2015)  
Target
Name:
Rho-associated protein kinase 1
Synonyms:
ROCK-I ROCK1_HUMAN Rho-associated protein kinase Rho-associated, coiled-coil-containing protein kinase 1 Rho-kinase (ROCK I) p160 ROCK-1 | p160ROCK
Type:
Serine/threonine-protein kinase
Mol. Mass.:
158156.77
Organism:
Homo sapiens (Human)
Description:
Q13464
Residue:
1354
  
Inhibitor
Name:
BDBM50097151
Synonyms:
CHEMBL3581148
Type:
Small organic molecule
Emp. Form.:
C18H16ClN3O3S2
Mol. Mass.:
421.921
SMILES:
CS(=O)(=O)Nc1cccc(CC(=O)Nc2cc(cs2)-c2ccnc(Cl)c2)c1
: