Target
Aurora kinase A
Ligand
BDBM50097414
Substrate
Meas. Tech.
ChEMBL_1502089 (CHEMBL3586964)
IC50
33±n/a nM
Citation
 Sells, TBChau, REcsedy, JAGershman, REHoar, KHuck, JJanowick, DAKadambi, VJLeRoy, PJStirling, MStroud, SGVos, TJWeatherhead, GSWysong, DRZhang, MBalani, SKBolen, JBManfredi, MGClaiborne, CF MLN8054 and Alisertib (MLN8237): Discovery of Selective Oral Aurora A Inhibitors. ACS Med Chem Lett 6:630-4 (2015)  
Target
Name:
Aurora kinase A
Synonyms:
AURKA_MOUSE Airk1 Aura Aurora Kinase A (Aurora-A) Aurora-family kinase 1 Ayk1 Iak1 Serine/threonine-protein kinase Aurora-A Stk15 | Stk6
Type:
Enzyme
Mol. Mass.:
44791.66
Organism:
Mus musculus (mouse)
Description:
Residue:
395
  
Inhibitor
Name:
BDBM50097414
Synonyms:
CHEMBL3586468
Type:
Small organic molecule
Emp. Form.:
C25H16ClFN4O2
Mol. Mass.:
458.872
SMILES:
OC(=O)c1ccc(Nc2ncc3CN=C(c4ccccc4F)c4cc(Cl)ccc4-c3n2)cc1
: