Target
5-hydroxytryptamine receptor 2A
Ligand
BDBM50097675
Substrate
Meas. Tech.
ChEMBL_1504492 (CHEMBL3590934)
Ki
1.7±n/a nM
Citation
 Hansen, MJacobsen, SEPlunkett, SLiebscher, GEMcCorvy, JDBräuner-Osborne, HKristensen, JL Synthesis and pharmacological evaluation of N-benzyl substituted 4-bromo-2,5-dimethoxyphenethylamines as 5-HT2A/2C partial agonists. Bioorg Med Chem 23:3933-7 (2015)  
Target
Name:
5-hydroxytryptamine receptor 2A
Synonyms:
5-HT-2 5-HT2A 5-hydroxytryptamine receptor 2A (5HT-2A) 5HT2A_HUMAN HTR2A | Serotonin receptor 2A
Type:
undefined
Mol. Mass.:
52607.65
Organism:
Homo sapiens (Human)
Description:
P28223
Residue:
471
  
Inhibitor
Name:
BDBM50097675
Synonyms:
CHEMBL3589580
Type:
Small organic molecule
Emp. Form.:
C19H20BrNO2S
Mol. Mass.:
406.337
SMILES:
COc1cc(CCNCc2cccc3ccsc23)c(OC)cc1Br
: