Target
5-hydroxytryptamine receptor 2A
Ligand
BDBM50097684
Substrate
Meas. Tech.
ChEMBL_1504492 (CHEMBL3590934)
Ki
83±n/a nM
Citation
 Hansen, MJacobsen, SEPlunkett, SLiebscher, GEMcCorvy, JDBräuner-Osborne, HKristensen, JL Synthesis and pharmacological evaluation of N-benzyl substituted 4-bromo-2,5-dimethoxyphenethylamines as 5-HT2A/2C partial agonists. Bioorg Med Chem 23:3933-7 (2015)  
Target
Name:
5-hydroxytryptamine receptor 2A
Synonyms:
5-HT-2 5-HT2A 5-hydroxytryptamine receptor 2A (5HT-2A) 5HT2A_HUMAN HTR2A | Serotonin receptor 2A
Type:
undefined
Mol. Mass.:
52607.65
Organism:
Homo sapiens (Human)
Description:
P28223
Residue:
471
  
Inhibitor
Name:
BDBM50097684
Synonyms:
CHEMBL3589589
Type:
Small organic molecule
Emp. Form.:
C16H19BrN2O2
Mol. Mass.:
351.238
SMILES:
COc1cc(CCNCc2cccnc2)c(OC)cc1Br
: