Target
Dual specificity tyrosine-phosphorylation-regulated kinase 1B
Ligand
BDBM50097858
Substrate
Meas. Tech.
ChEMBL_1502249 (CHEMBL3591328)
IC50
>10000±n/a nM
Citation
 Falke, HChaikuad, ABecker, ALoaëc, NLozach, OAbu Jhaisha, SBecker, WJones, PGPreu, LBaumann, KKnapp, SMeijer, LKunick, C 10-iodo-11H-indolo[3,2-c]quinoline-6-carboxylic acids are selective inhibitors of DYRK1A. J Med Chem 58:3131-43 (2015)  
Target
Name:
Dual specificity tyrosine-phosphorylation-regulated kinase 1B
Synonyms:
DYR1B_HUMAN Dual specificity tyrosine-phosphorylation-regulated kinase 1B MIRK
Type:
Enzyme
Mol. Mass.:
69222.24
Organism:
Homo sapiens (Human)
Description:
Q9Y463
Residue:
629
  
Inhibitor
Name:
BDBM50097858
Synonyms:
CHEMBL3589669
Type:
Small organic molecule
Emp. Form.:
C18H13ClN2O3
Mol. Mass.:
340.76
SMILES:
CCOc1ccc2c3[nH]c4c(Cl)cccc4c3c(nc2c1)C(O)=O
: