Target
Mitogen-activated protein kinase 1
Ligand
BDBM50097871
Substrate
Meas. Tech.
ChEMBL_1502243 (CHEMBL3591179)
IC50
>10000±n/a nM
Citation
 Falke, HChaikuad, ABecker, ALoaëc, NLozach, OAbu Jhaisha, SBecker, WJones, PGPreu, LBaumann, KKnapp, SMeijer, LKunick, C 10-iodo-11H-indolo[3,2-c]quinoline-6-carboxylic acids are selective inhibitors of DYRK1A. J Med Chem 58:3131-43 (2015)  
Target
Name:
Mitogen-activated protein kinase 1
Synonyms:
ERK2 Extracellular signal-regulated kinase 2 Extracellular signal-regulated kinase 2 (ERK2) MAPK 2 MK01_HUMAN Mitogen-activated protein kinase 1 (ERK-2) Mitogen-activated protein kinase 2 PRKM2 | p42-MAPK
Type:
Ser/Thr Protein Kinase
Mol. Mass.:
41392.76
Organism:
Homo sapiens (Human)
Description:
P28482
Residue:
360
  
Inhibitor
Name:
BDBM50097871
Synonyms:
CHEMBL3589659
Type:
Small organic molecule
Emp. Form.:
C16H8ClIN2O2
Mol. Mass.:
422.604
SMILES:
OC(=O)c1nc2ccc(I)cc2c2[nH]c3ccc(Cl)cc3c12
: