Target
Cyclin-dependent kinase 2
Ligand
BDBM50097867
Substrate
Meas. Tech.
ChEMBL_1502238 (CHEMBL3591174)
IC50
>10000±n/a nM
Citation
 Falke, HChaikuad, ABecker, ALoaëc, NLozach, OAbu Jhaisha, SBecker, WJones, PGPreu, LBaumann, KKnapp, SMeijer, LKunick, C 10-iodo-11H-indolo[3,2-c]quinoline-6-carboxylic acids are selective inhibitors of DYRK1A. J Med Chem 58:3131-43 (2015)  
Target
Name:
Cyclin-dependent kinase 2
Synonyms:
CDK2 CDK2_HUMAN Cell division protein kinase 2 Protein cereblon/Cyclin-dependent kinase 2 | p33 protein kinase
Type:
Enzyme Subunit
Mol. Mass.:
33938.17
Organism:
Homo sapiens (Human)
Description:
P24941
Residue:
298
  
Inhibitor
Name:
BDBM50097867
Synonyms:
CHEMBL3589660
Type:
Small organic molecule
Emp. Form.:
C16H9ClN2O2
Mol. Mass.:
296.708
SMILES:
OC(=O)c1nc2ccccc2c2[nH]c3c(Cl)cccc3c12
: