Target
Cyclin-dependent kinase 5
Ligand
BDBM50097857
Substrate
Meas. Tech.
ChEMBL_1502239 (CHEMBL3591175)
IC50
>10000±n/a nM
Citation
 Falke, HChaikuad, ABecker, ALoaëc, NLozach, OAbu Jhaisha, SBecker, WJones, PGPreu, LBaumann, KKnapp, SMeijer, LKunick, C 10-iodo-11H-indolo[3,2-c]quinoline-6-carboxylic acids are selective inhibitors of DYRK1A. J Med Chem 58:3131-43 (2015)  
Target
Name:
Cyclin-dependent kinase 5
Synonyms:
CDK5 CDKN5 Cyclin-dependent kinase 5 (CDK5/ p25) Cyclin-dependent-like kinase 5 PSSALRE Tau protein kinase II catalytic subunit
Type:
Enzyme Subunit
Mol. Mass.:
33308.61
Organism:
Homo sapiens (Human)
Description:
Residue:
292
  
Inhibitor
Name:
BDBM50097857
Synonyms:
CHEMBL3589668
Type:
Small organic molecule
Emp. Form.:
C16H8Cl2N2O2
Mol. Mass.:
331.153
SMILES:
OC(=O)c1nc2cc(Cl)ccc2c2[nH]c3c(Cl)cccc3c12
: