Target
N-formyl peptide receptor 2
Ligand
BDBM50098174
Substrate
Meas. Tech.
ChEMBL_1502490 (CHEMBL3592312)
EC50
4.0±n/a nM
Citation
 Stepniewski, TMFilipek, S Non-peptide ligand binding to the formyl peptide receptor FPR2--A comparison to peptide ligand binding modes. Bioorg Med Chem 23:4072-81 (2015)  
Target
Name:
N-formyl peptide receptor 2
Synonyms:
ALXR, FPRL1, FPR2 FPR2 FPRH1 Formyl Peptide Receptor-Like 1 LXA4 receptor Lipoxin A4 receptor RFP | hFPRL
Type:
G Protein-Coupled Receptor (GPCR)
Mol. Mass.:
38968.35
Organism:
Homo sapiens (Human)
Description:
P25090
Residue:
351
  
Inhibitor
Name:
BDBM50098174
Synonyms:
CHEMBL3588929
Type:
Small organic molecule
Emp. Form.:
C21H24BrN5O3
Mol. Mass.:
474.351
SMILES:
Brc1ccc(NC(=O)N[C@@H](Cc2ccccc2)C(=O)NN2CCCCNC2=O)cc1
: