Target
Bromodomain adjacent to zinc finger domain protein 2A
Ligand
BDBM50098305
Substrate
Meas. Tech.
ChEMBL_1502826 (CHEMBL3591386)
Kd
3981±n/a nM
Citation
 Bamborough, PChung, CWFurze, RCGrandi, PMichon, AMSheppard, RJBarnett, HDiallo, HDixon, DPDouault, CJones, EJKaramshi, BMitchell, DJPrinjha, RKRau, CWatson, RJWerner, TDemont, EH Structure-Based Optimization of Naphthyridones into Potent ATAD2 Bromodomain Inhibitors. J Med Chem 58:6151-78 (2015)  
Target
Name:
Bromodomain adjacent to zinc finger domain protein 2A
Synonyms:
BAZ2A Bromodomain adjacent to zinc finger domain protein 2A KIAA0314 TTF-I-interacting protein 5 hWALp3
Type:
PROTEIN
Mol. Mass.:
211197.21
Organism:
Homo sapiens (Human)
Description:
ChEMBL_108002
Residue:
1905
  
Inhibitor
Name:
BDBM50098305
Synonyms:
CHEMBL3590405
Type:
Small organic molecule
Emp. Form.:
C27H34N4O4S
Mol. Mass.:
510.648
SMILES:
Cc1cncc(c1)-c1ccc(N[C@@H]2CCNC[C@H]2OCC2CCS(=O)(=O)CC2)c2[nH]c(=O)c(C)cc12
: